�ϐ���,�����ϐ�,����,��q��,�h��,�����,�˒ˋ�,�`���,�`�k��,�_�ސ��,���J��,����,�t��,���,����,�ߌ���,�s�}��,���,�ۓy�P�J��,�΋�,�s�O
(Intercept),,88.25974012,19.1262314,11.32104058,22.43241526,25.18391625,23.31067611,28.50679926,62.56606655,30.99400937,18.55959898,43.07467487,32.47491902,66.95192002,54.05148517,12.94504118,26.3828297,23.00119265,14.57163961,0.539696708
cloud,���ω_��,,,,,,,,,,,,,,,,,,,-0.005941682
effort.cam,�~�}�ԓK�����p�L���,,,,,,,,,,,,,,,,,,,
effort.cam.lag1,�O�N�x�̋~�}�ԓK�����p�L���,-0.000411575,-0.000256702,-0.00017655,-0.000366582,-0.00039922,-0.000509204,-0.000417968,-0.000444752,-0.000236699,-0.0004051,-0.000525708,-0.000249603,-0.000407557,-0.000392559,-0.000154333,-0.00035504,-0.000213391,-0.000243285,-2.21E-06
holiday2.add,�x���Ƃ��̗����i�_�~�[�ϐ��j,1.1063448,,0.216974753,,0.829260859,0.423390887,1.755045291,0.499290032,0.737436739,2.084148649,1.349588785,0.475766546,3.398163015,0.294276859,0.765817091,0.250763736,0.44173788,0.810017894,0.090718974
holidays.next,�A�x��̕����i�_�~�[�ϐ��j,1.055267617,1.395709665,0.348283321,1.392267241,1.320924477,1.043348736,,1.596761341,,-1.672294408,-0.311537754,0.598733125,-2.921784623,1.844310344,0.29778434,1.841047281,1.004937757,0.581889948,-0.106633895
I(effort.cam.lag1^2),,8.42993E-09,5.11E-09,3.70E-09,7.67E-09,8.23E-09,1.14E-08,8.00E-09,1.03E-08,5.22E-09,9.35E-09,1.17E-08,5.58E-09,8.04E-09,7.96E-09,3.20E-09,6.80E-09,3.90E-09,5.12E-09,
I(effort.cam^2),,,5.17E-10,5.32E-10,,7.57E-10,1.61E-09,1.68E-09,1.82E-09,1.34E-09,1.99E-09,1.96E-09,5.37E-10,,5.71E-10,4.58E-10,,,1.05E-09,
I(mean.pres.dif^2),,,,,,0.00295193,,,,,,,,,,,,,,
I(mean.temp.dif^2),,-0.016629261,,,,0.018209022,,,,,,,,,,,-0.017378284,,,
I(mean.temp.lag1^2),,0.01830165,,0.003356338,0.016554139,0.013467663,,0.005442536,0.015258711,,0.004559158,0.009248714,,0.009797726,0.013515957,,,,0.006765185,
I(mean.temp.lag2^2),,-0.001995101,,,,,0.002206205,0.003540056,,0.001373966,,,,,,,-0.002261851,,,
I(mean.temp.lag3^2),,,,0.001419554,,,,,,,,,0.009627795,,,0.001540406,,,,0.000357237
I(mean.temp.lag4^2),,,,,,,,,-0.002271293,,,,,,,-0.002862441,,,,
I(mean.temp.lag5^2),,,,-0.001388632,-0.001173162,,0.007580604,-0.002557173,,0.002667407,,-0.001620261,,,-0.002796723,,,0.009686782,,
I(mean.temp^2),,0.003886016,0.015010164,0.007979055,,0.007336633,,0.009537168,0.007278,,0.004810988,0.006947125,,0.007164358,0.008949406,0.011598826,0.014458779,0.001918279,0.004667301,
inbound,�O���l�̂׏h���Ґ�,,,,,,,,,,,,,,,,,,,
inflow,�����̗����l��,,,,,,,,,,,,,,,,,,,
max.temp,�ō��C��,,,,,,,,,,,,,,,,,,,
mean.pres,���ϋC��,-0.057995443,,,,,,,-0.033109202,-0.01813884,,-0.020423486,-0.018772495,-0.031010155,-0.020456046,,,,,
mean.pres.dif,�O���Ƃ̕��ϋC����,0.032137159,,0.020519744,,,,,,0.028724601,0.030146936,,,,,,,-0.025762317,,
mean.pres.dif.abs,�O���Ƃ̕��ϋC�����̐�Βl,,0.03611105,,,,,,,,,,,,,,,,,
mean.temp,���ϋC��,,-0.479016203,-0.341102528,-0.487998163,-0.590204093,,,,,,,,,,,,,,
mean.temp.dif,�O���Ƃ̕��ω��x��,,0.077040331,0.232683869,0.661277219,0.698803672,0.147878178,0.362646736,,0.10751971,0.333494595,,,,,,,,0.272213977,
mean.temp.dif.abs,�O���Ƃ̕��ω��x���̐�Βl,,,0.137374813,,,,,,,,,,-0.11803089,,,,,-0.098276419,
mean.temp.lag1,1���O�̕��ϋC��,-0.769592739,,,,,,,-0.659978986,,,-0.451382694,,-0.441485592,-0.624458615,,,,,
mean.temp.lag2,2���O�̕��ϋC��,,,,,,,,,,,,,,,,,,,-0.008252181
mean.temp.lag3,3���O�̕��ϋC��,,,,,,,,,,,,-0.366698436,,,,,,,
mean.temp.lag4,4���O�̕��ϋC��,,,,,,,,,,,,,,,,,,,
mean.temp.lag5,5���O�̕��ϋC��,,,,,,-0.377232885,,,-0.15711908,,,,,,,,-0.394153964,,
min.temp,�Œ�C��,,,,,,,-0.430161264,,,-0.30432044,,,,,-0.320036271,-0.325327552,,-0.335053967,
month01,���i�_�~�[�ϐ��j,0.912412462,0.971250217,0.989926081,0.713302796,2.189901283,1.663990518,2.493445802,1.319029303,1.45701322,0.90599827,0.466806661,0.961464621,0.670402243,3.112264614,-0.351165948,2.435046217,2.159183144,1.175019695,
month02,���i�_�~�[�ϐ��j,0.482643162,0.778821498,0.452573199,-0.244138765,1.166492145,0.438018183,1.298222692,1.069185698,1.103763477,1.080177895,0.386503999,0.894176711,0.755498386,2.114696254,-0.354930114,0.895900356,1.169463659,0.601214992,
month03,���i�_�~�[�ϐ��j,-0.063816082,0.634943682,0.417462205,0.03698151,0.811774696,0.217470208,1.151981817,0.276960645,0.819878838,0.669214683,0.263270761,0.522326032,-0.059295388,0.945576213,-0.044205707,0.622497294,0.554524613,0.415070373,
month05,���i�_�~�[�ϐ��j,0.381559329,-0.068628421,-0.047506136,-0.698264798,-0.733291947,-0.471346084,-1.177002751,-0.250480429,-0.03259005,-0.288547833,-0.146037536,0.328988734,-1.567185475,-0.592107648,-0.767455895,-0.85349948,-0.702148469,-0.305818689,
month06,���i�_�~�[�ϐ��j,-0.248814077,-0.507386886,0.138859075,-1.349349004,-0.817002517,-0.647627633,-0.058989802,-0.488160899,0.035191021,-0.069931558,-0.609977005,0.254139523,-1.948959033,-0.205159118,-0.191586933,-1.556381299,-0.153840788,-0.621584653,
month07,���i�_�~�[�ϐ��j,1.462807505,0.980071224,0.204488699,0.149920382,0.501445522,1.03176848,0.589408046,0.497109138,0.870468308,0.993918095,0.514138524,1.454684265,-0.713650964,1.104745116,0.903838968,0.24701283,1.59325759,0.172462991,
month08,���i�_�~�[�ϐ��j,0.234718041,-0.615635066,-0.475916868,-0.479042819,-1.475871152,0.506408233,-0.97681562,-0.604344278,0.81340981,0.437091891,-1.659104793,0.677725353,-1.834825759,-0.323175667,-0.922559307,-0.809561282,0.245229634,-0.515685447,
month09,���i�_�~�[�ϐ��j,0.638151328,-0.164908107,-0.331199239,-0.907837276,-1.564334384,-0.265776195,-1.394266519,-0.654418646,0.461253027,-0.319465414,-0.902444103,0.417520103,-1.96289211,0.308138862,-0.798643359,-1.507293238,0.237788309,-0.609288822,
month10,���i�_�~�[�ϐ��j,1.501274509,0.568757215,0.424830884,-0.135686531,0.4409015,0.185767556,0.40872857,1.00113762,1.000590736,0.256423358,0.538486052,1.113513117,-0.311265972,1.087417735,-0.074342251,-0.500308783,0.579030582,0.734223799,
month11,���i�_�~�[�ϐ��j,1.333803425,1.365847574,0.909001776,1.408734903,2.317330759,0.909979824,2.045629065,1.967007371,1.010949274,0.983952777,1.563187239,1.52099012,0.206588979,1.953362873,0.372789003,0.631261661,1.479654823,1.378497769,
month12,���i�_�~�[�ϐ��j,2.955261834,2.547356417,1.774860436,2.159800578,4.435832901,3.56384847,5.951478068,4.239788969,2.053541222,4.110363936,4.062472991,2.436623291,3.963169332,4.880048311,2.209604864,3.244301342,3.710476147,2.226166345,
over.50,���l�s��50�Έȏ�̐l��,,,,,,,,,,,,,,,,,,,
over.55,���l�s��55�Έȏ�̐l��,,,,,,,,,,,,,,,,,,,-2.31E-07
over.60,���l�s��60�Έȏ�̐l��,,,,,,,,,,,,,,,,,,,
over.65,���l�s��65�Έȏ�̐l��,,,,,,,,,,,,,,,,,,,
over.70,���l�s��70�Έȏ�̐l��,,,,,,,,,,,,,,,,,,,
over.75,���l�s��75�Έȏ�̐l��,,,,,,,,,,,,,,,,,,,
over.80,���l�s��80�Έȏ�̐l��,,,,,,,,,,,,,,,,,,,
over.85,���l�s��85�Έȏ�̐l��,6.76867E-05,4.62E-05,4.66E-05,7.04E-05,0.000134528,8.02E-05,9.06E-05,6.93E-05,3.41E-05,4.19E-05,8.63E-05,6.65E-05,4.51E-05,7.07E-05,7.03E-05,5.69E-05,5.03E-05,6.49E-05,
rain,�~����,-0.017963811,,,-0.014943428,,-0.014392588,,,-0.01328319,0.0110747,,-0.012705693,,,,,,,0.001577802
rel.humid,���ϑ��Ύ��x,,,-0.009022123,,-0.037603058,,,-0.012853577,,,-0.018279019,,,-0.015943518,,-0.014717264,,,
s7119,��7119���p��,56.26821276,63.93682255,32.49549219,46.18617058,41.76952858,66.96538837,62.13469136,57.98220374,31.31971657,40.05569879,90.79727716,,76.80028852,87.9945245,29.39086461,101.82423,31.01061863,48.72266065,
snow,�~���,0.468197918,,0.230940726,0.419352084,0.384165896,0.395524249,0.40790979,0.347472844,0.268523678,,0.630084315,,,0.422561299,,0.155983908,0.235369739,0.214891357,0.046076792
sunshine,���Ǝ���,0.116640846,0.101941136,0.036627389,0.116700543,0.040088382,0.071609015,0.078284719,0.079625227,0.073663094,0.014212876,0.055264774,0.107397154,0.211566835,0.10991505,0.033302427,0.022289123,0.129678559,0.028217852,
